{"text_format":"1","workbook":"xlsx","n_sheets":11,"sheets":["Cuadro 1 Formulación PAO","Ficha del Indicador","Monitoreo I Trimestre","Cuadro 2 Seguimiento Semestral","Cuadro 3 Análisis Semestral","Cuadro 4 Analisis Semestral","Cuadro 5 Reprogramación","Monitoreo III Trimestre","Cuadro 6 Seguimiento Anual","Cuadro 7","Cuadro 8"],"not_rendered":{"charts":0,"images":0,"macros":1,"external_links":2,"defined_names":23,"comments":2,"pivot_tables":0},"unopened":[],"bounds":{"document_bytes":16777216,"sheet_cells":100000,"rows_first":2000,"rows_last":500,"rows_between":2000,"halvings":0,"cell_chars":16384,"cell_head_chars":4096},"cells_cut":0,"cells_raw":0,"read":"whole","date_system":"1900"}

{"sheet":"Cuadro 1 Formulación PAO","index":0,"n_rows":141,"n_cols":14,"rows_kept":141,"cut":false,"hidden":false,"merged":[[53,2,53,9],[54,2,54,9],[1,0,1,13],[7,3,7,12],[11,8,11,10],[4,2,4,13],[5,2,5,13],[6,2,6,13],[50,4,51,6],[46,4,46,10],[48,4,48,10]]}
[]
["Instrumento para la Formulación del Plan Anual Operativo (PAO)"]
[]
[]
[null,null,"Cuadro N. 1"]
[null,null,"MINISTERIO DE SEGURIDAD PÚBLICA"]
[null,null,"PLAN ANUAL OPERATIVO"]
[null,null,"DEPENDENCIA: ","ACADEMIA NACIONAL DE POLICÍA"]
[]
["Año: ",null,2024]
{"$rows_left_out":132}
{"sheet":"Ficha del Indicador","index":1,"n_rows":105,"n_cols":13,"rows_kept":105,"cut":false,"hidden":false,"merged":[[1,1,2,8]]}
[]
[null,"Matriz de indicadores",null,null,null,null,null,null,null,null,null,null,"Indicador de la actividad"]
[null,null,null,null,null,null,null,null,null,null,null,null,"<>\"\""]
[]
[null,"ID","Indicador de la actividad","Tipo de indicador","Meta","Definición e interpretación del indicador","Fórmula de cálculo","Componentes de la fórmula de cálculo","Unidad de medida del indicador","Línea base","Fuente de Información"]
[1,{"$f":"IF(C6<>\"\",A6,\"\")","v":1},"Porcentaje de personas \ninstructoras con \ncapacidades instaladas \npara formar a \nfuncionarios policiales en \nLegitimación Policial","Eficacia",1,"Definición: Se refiera a las personas instructoras en su capacidad máxima para formar cierta cantidad de funcionarios policiales en Legitimación Policial.\nPara lo anterior, cada curso deberá contar con una línea base de personas, para garantizar la correcta asignación de instructores en la formación que se impartirá.","PICI/CTI*100","PICI: Personas instructoras capacidad instalada \nCTI: Cantidad total de instructores\n","Porcentaje","NA","Informe de la Dirección \nAcadémica\n"]
[2,{"$f":"IF(C7<>\"\",A7,\"\")","v":2},"Opinión favorable","Calidad",0.85,"Definición: Es el resultado de la encuesta que se aplica a los funcionarios policiales que finalizan el curso de formación durante el periodo de referencia. Se realiza por medio de una única pregunta: \nOpinión sobre el curso finalizado con dos únicas opciones: Favorable o No \nfavorable.  \nInterpretación: Del total de encuestas aplicadas a funcionarios policiales que finalizaron curso de formación durante el periodo se espera obtener un 85% con opinión favorable sobre los cursos recibidos. ","(TFPOFCF/ TFPFCF)*100\n","TFPOFCF=Total de funcionarios \npoliciales que finalizaron curso \nde formación con opinión \nfavorable. \nTFPFCF= Total de funcionarios \npoliciales que finalizaron \ncursos de formación durante el \nperiodo de referencia ","Porcentaje",0.8,"Informe Unidad de \nInvestigación, Evaluación y Diseño Curricular\n"]
[3,3,"Investigaciones Académicas realizadas","Producto",2,"Definición: Corresponde a las investigaciones académicas realizadas sobre la intención de  identificar hechos o factores de riesgo que ayuden a resolver o mitigar situaciones de índole policial ","∑IAR","∑IAR= Sumatoria de las Investigaciones Académicas realizadas","Numero","NA","Oficio Unidad Investigación, Evaluación y Desarrollo Curricular  "]
[4,4,"Planes de estudio de los cursos de especialización derivados de los estándares del Marco de Cualificación diseñados","Producto",3,"Definición: Corresponde a los planes de estudio de los cursos de especialización derivados de los Estándares del Marco de Cualificación diseñados considerando los requerimientos de los cuerpos policiales \nInterpretación: La Academia Nacional de Policía diseño “X” de planes de estudio de los cursos de especialización derivados del Marco de Cualificación \n","∑PECEMCD","∑PECEMCD= Sumatoria de planes de estudio de los cursos de especialización Marco Cualificación diseñados    ","Numero","NA","Oficio Unidad Investigación, Evaluación y Desarrollo Curricular  "]
[5,5,"Planes de estudio de los cursos de especialización derivados de los estándares del Marco de Cualificación implementados","Producto",3,"Definición: Corresponde a los planes de estudio de los cursos de especialización derivados de los Estándares del Marco de Cualificación implementados considerando los requerimientos de los cuerpos policiales \nInterpretación: La Academia Nacional de Policía implemento “X” de planes de estudio de los cursos de especialización derivados del Marco de Cualificación\n","∑PECEMCI","∑PECEMCD= Sumatoria de planes de estudio de los cursos de especialización Marco Cualificación implementados","Numero","NA","Oficio Dirección Académica"]
{"$rows_left_out":96}
{"sheet":"Monitoreo I Trimestre","index":2,"n_rows":99,"n_cols":11,"rows_kept":99,"cut":false,"hidden":false,"merged":[[12,3,12,4],[16,7,16,10],[1,2,1,10],[5,3,5,10],[7,4,7,10],[3,2,3,10],[4,2,4,10]]}
[]
[null,null,"Instrumento de Monitoreo Trimestral Plan Anual Operativo"]
[]
[null,null,"Monitoreo Ier Trimestre"]
[null,null,"MINISTERIO DE SEGURIDAD PÚBLICA"]
[]
[]
[null,null,"Dirección o Unidad:",null,{"$f":"'Cuadro 1 Formulación PAO'!D8","v":"ACADEMIA NACIONAL DE POLICÍA"}]
[]
[null,null,"Nombre del Encargado de la elaboración:"]
{"$rows_left_out":90}
{"sheet":"Cuadro 2 Seguimiento Semestral","index":3,"n_rows":145,"n_cols":15,"rows_kept":145,"cut":false,"hidden":false,"merged":[[1,2,1,12],[16,7,16,9],[3,3,3,12],[4,3,4,12],[5,3,5,12],[12,3,12,4],[9,5,9,9],[7,4,7,11]]}
[]
[null,null,"Instrumento de Seguimiento Semestral Plan Anual Operativo"]
[]
[null,null,null,"Cuadro N. 2"]
[null,null,null,"MINISTERIO DE SEGURIDAD PÚBLICA"]
[null,null,null,"SEGUIMIENTO SEMESTRAL PLAN ANUAL OPERATIVO"]
[]
[null,null,"Dirección o Unidad:",null,{"$f":"'Cuadro 1 Formulación PAO'!D8","v":"ACADEMIA NACIONAL DE POLICÍA"}]
[]
[null,null,"Nombre del Encargado de la elaboración:",null,null,null,null,null,null,null,null,null,null,null,"Indicador de la actividad"]
{"$rows_left_out":136}
{"sheet":"Cuadro 3 Análisis Semestral","index":4,"n_rows":197,"n_cols":6,"rows_kept":197,"cut":false,"hidden":false,"merged":[[3,0,3,2],[5,0,5,2],[0,0,0,2],[1,0,1,2]]}
["Análisis"]
["Avances por indicador"]
[]
["Considerando la columna de clasificación de la matriz de seguimiento PAO, para aquellos indicadores que presenten un grado de avance cuyo  criterio de evaluación sea “Incumplimiento” o  “Con riesgo de incumplimiento”, se deberá completar el cuadro N. 3 seleccionando las causas que considere afectaron el avance, e indicar las acciones correctivas que se implementarán en el segundo semestre, con el fin de cumplir con las metas programadas para el año."]
[]
["Cuadro N. 3"]
["Indicador","Causa de Retraso o incumplimiento","Acciones Correctivas"]
[{"$f":"IFERROR(VLOOKUP('Cuadro 3 Análisis Semestral'!E8,'Cuadro 2 Seguimiento Semestral'!$A$19:$M$100,6,0),\"\")","v":""},null,null,null,1]
[{"$f":"IFERROR(VLOOKUP('Cuadro 3 Análisis Semestral'!E9,'Cuadro 2 Seguimiento Semestral'!$A$19:$M$100,6,0),\"\")","v":""},null,null,null,2]
[{"$f":"IFERROR(VLOOKUP('Cuadro 3 Análisis Semestral'!E10,'Cuadro 2 Seguimiento Semestral'!$A$19:$M$100,6,0),\"\")","v":""},null,null,null,3]
{"$rows_left_out":188}
{"sheet":"Cuadro 4 Analisis Semestral","index":5,"n_rows":100,"n_cols":2,"rows_kept":100,"cut":false,"hidden":false,"merged":[[5,0,5,1],[3,0,3,1],[0,0,0,1],[1,0,1,1]]}
["Análisis"]
["Avances por indicador"]
[]
["Para los indicadores con un grado de avance “De acuerdo a lo programado” y “Sobrecumplimiento” las dependencias deberán llenar el cuadro N. 4 con la información sobre los principales logros y resultados obtenidos durante el primer semestre y los efectos reflejados en la población meta, a la cual van dirigidas las acciones."]
[]
["Cuadro N. 4"]
["Indicador","Principales logros y resultados"]
[{"$f":"IFERROR(VLOOKUP('Cuadro 3 Análisis Semestral'!E8,'Cuadro 2 Seguimiento Semestral'!$B$19:$M$100,5,0),\"\")","v":""}]
[{"$f":"IFERROR(VLOOKUP('Cuadro 3 Análisis Semestral'!E9,'Cuadro 2 Seguimiento Semestral'!$B$19:$M$100,5,0),\"\")","v":""}]
[{"$f":"IFERROR(VLOOKUP('Cuadro 3 Análisis Semestral'!E10,'Cuadro 2 Seguimiento Semestral'!$B$19:$M$100,5,0),\"\")","v":""}]
{"$rows_left_out":91}
{"sheet":"Cuadro 5 Reprogramación","index":6,"n_rows":24,"n_cols":16384,"rows_kept":24,"cut":false,"hidden":false,"merged":[[11,1,11,2],[21,0,21,7],[1,0,1,7],[3,0,3,7],[4,0,4,7],[5,0,5,7],[7,1,7,6],[20,3,20,6],[9,2,9,6]]}
[]
["Instrumento de Reprogramación Plan Anual Operativo"]
[]
["Cuadro N. 5"]
["MINISTERIO DE SEGURIDAD PÚBLICA"]
["REPROGRAMACIÓN PLAN ANUAL OPERATIVO"]
[]
["Dirección o Unidad:",{"$f":"'Cuadro 1 Formulación PAO'!D8","v":"ACADEMIA NACIONAL DE POLICÍA"}]
[]
["Nombre del Encargado de la elaboración:"]
{"$rows_left_out":15}
{"sheet":"Monitoreo III Trimestre","index":7,"n_rows":100,"n_cols":11,"rows_kept":100,"cut":false,"hidden":false,"merged":[[16,7,16,10],[1,2,1,10],[7,4,7,10],[12,3,12,4],[5,2,5,10],[4,2,4,10],[3,2,3,10],[9,5,9,10]]}
[]
[null,null,"Instrumento de Monitoreo III Trimestre"]
[]
[]
[null,null,"MINISTERIO DE SEGURIDAD PÚBLICA"]
[null,null,"Monitoreo III Trimestre PLAN ANUAL OPERATIVO"]
[]
[null,null,"Dirección o Unidad:",null,{"$f":"'Cuadro 1 Formulación PAO'!D8","v":"ACADEMIA NACIONAL DE POLICÍA"}]
[]
[null,null,"Nombre del Encargado de la elaboración:"]
{"$rows_left_out":91}
{"sheet":"Cuadro 6 Seguimiento Anual","index":8,"n_rows":100,"n_cols":16,"rows_kept":100,"cut":false,"hidden":false,"merged":[[0,2,0,13],[12,7,12,11],[10,3,10,6],[6,4,6,12],[2,2,2,12],[3,2,3,12],[4,2,4,12],[8,5,8,11]]}
[null,null,"Instrumento de Seguimiento Anual Plan Anual Operativo"]
[]
[null,null,"Cuadro N. 6"]
[null,null,"MINISTERIO DE SEGURIDAD PÚBLICA"]
[null,null,"SEGUIMIENTO ANUAL PLAN ANUAL OPERATIVO"]
[]
[null,null,"Dirección o Unidad: ",null,{"$f":"'Cuadro 1 Formulación PAO'!D8","v":"ACADEMIA NACIONAL DE POLICÍA"}]
[]
[null,null,"Nombre del Encargado de la elaboración:"]
[]
{"$rows_left_out":91}
{"sheet":"Cuadro 7","index":9,"n_rows":100,"n_cols":4,"rows_kept":100,"cut":false,"hidden":false,"merged":[[0,1,0,3],[1,1,1,3],[3,1,3,3],[5,1,5,3]]}
[null,"Análisis"]
[null,"Avances por indicador"]
[]
[null,"Considerando la columna de clasificación de la matriz de seguimiento anual del PAO, para aquellos indicadores que presenten un grado de avance cuyo  criterio de evaluación sea “Parcialmente Cumplida” o  “No Cumplida”, se deberá completar el cuadro N. 7 seleccionando las causas que considere llevaron al incumplimiento e indicar las acciones para el subsane , con el fin de minimizar el impacto en los objetivos."]
[]
[null,"Cuadro N. 7"]
[null,"Indicador","Causa del incumplimiento","Acciones para subsanar"]
[null,{"$f":"IFERROR(VLOOKUP('Cuadro 3 Análisis Semestral'!E8,'Cuadro 6 Seguimiento Anual'!$A$15:$L$100,6,0),\"\")","v":"Indicador 2"}]
[null,{"$f":"IFERROR(VLOOKUP('Cuadro 3 Análisis Semestral'!E9,'Cuadro 6 Seguimiento Anual'!$A$15:$L$100,6,0),\"\")","v":"Indicador 3"}]
[null,{"$f":"IFERROR(VLOOKUP('Cuadro 3 Análisis Semestral'!E10,'Cuadro 6 Seguimiento Anual'!$A$15:$L$100,6,0),\"\")","v":""}]
{"$rows_left_out":91}
{"sheet":"Cuadro 8","index":10,"n_rows":100,"n_cols":3,"rows_kept":100,"cut":false,"hidden":false,"merged":[[0,1,0,2],[1,1,1,2],[3,1,3,2],[5,1,5,2]]}
[null,"Análisis"]
[null,"Avances por indicador"]
[]
[null,"Para los indicadores con un grado de avance “Cumplido” y “Sobrecumplido” las dependencias deberán llenar el cuadro N. 8 con la información sobre los principales logros y resultados obtenidos durante el año y los efectos reflejados en la población meta, a la cual van dirigidas las acciones."]
[]
[null,"Cuadro N. 8"]
[null,"Indicador","Principales logros y resultados"]
[null,{"$f":"IFERROR(VLOOKUP('Cuadro 3 Análisis Semestral'!E8,'Cuadro 6 Seguimiento Anual'!$B$15:$N$100,5,0),\"\")","v":"Indicador 1"}]
[null,{"$f":"IFERROR(VLOOKUP('Cuadro 3 Análisis Semestral'!E9,'Cuadro 6 Seguimiento Anual'!$B$15:$N$100,5,0),\"\")","v":""}]
[null,{"$f":"IFERROR(VLOOKUP('Cuadro 3 Análisis Semestral'!E10,'Cuadro 6 Seguimiento Anual'!$B$15:$N$100,5,0),\"\")","v":""}]
{"$rows_left_out":90}